BDBM94624 (-)-Cocaethylene fumarate::(E)-but-2-enedioate;ethyl 3-benzoyloxy-8-methyl-8-azabicyclo[3.2.1]octane-4-carboxylate::(E)-but-2-enedioate;ethyl 8-methyl-3-(phenylcarbonyloxy)-8-azabicyclo[3.2.1]octane-4-carboxylate::3-benzoyloxy-8-methyl-8-azabicyclo[3.2.1]octane-4-carboxylic acid ethyl ester;(E)-2-butenedioate::3-benzoyloxy-8-methyl-8-azabicyclo[3.2.1]octane-4-carboxylic acid ethyl ester;fumarate::MLS002320699::SMR001338845::cid_45479832
SMILES [H]C12CCC([H])(C(C(C1)OC(=O)c1ccccc1)C(=O)OCC)N2C
InChI Key InChIKey=NMPOSNRHZIWLLL-UHFFFAOYSA-N
Data  3 IC50
  Tab Delimited (TSV)   2D SDfile   Computed 3D by Vconf -m prep SDfile
Find this compound or compounds like it in BindingDB:
Activity Spreadsheet -- Enzyme Inhibition Constant Data from BindingDB
Found 1 hit for monomerid = 94624
TargetHepatocyte nuclear factor 4-alpha(Homo sapiens (Human))
The Scripps Research Institute Molecular Screening Center
Curated by PubChem BioAssay
LigandPNGBDBM94624((-)-Cocaethylene fumarate | (E)-but-2-enedioate;et...)
Affinity DataIC50: >3.98E+4nM
In DepthDetails PCBioAssay